1-Propyne, 3,3-difluoro-
- Formula: C3H2F2
- Molecular weight: 76.0448
- IUPAC Standard InChIKey: ZCSBOJDDMSHDGG-UHFFFAOYSA-N
- CAS Registry Number: 18371-25-0
- Chemical structure:
View 3d structure (requires JavaScript / HTML 5) - Permanent link for this species. Use this link for bookmarking this species for future reference.

Gas phase ion energetics data

Data compiled by: Henry M. Rosenstock, Keith Draxl, Bruce W. Steiner, and John T. Herron
Ionization energy determinations
IE (eV) | Method | Reference |
---|---|---|
11.6 ± 0.1 | EI | Gil'burd, Syrvatka, et al., 1967 |
Appearance energy determinations
Ion | AE (eV) | Other Products | Method | Reference | Comment |
---|---|---|---|---|---|
CHF2+ | 13.8 ± 0.1 | C2H | EI | Gil'burd, Syrvatka, et al., 1967 | |
C2H+ | 16.19 ± 0.02 | CHF2 | EI | Gil'burd, Syrvatka, et al., 1967 | |
C3HF+ | 12.6 ± 0.15 | HF | EI | Gil'burd, Syrvatka, et al., 1967 | |
C3HF2+ | 12.9 ± 0.1 | H | EI | Gil'burd, Syrvatka, et al., 1967 | |
C3H2F+ | 14.2 ± 0.2 | F | EI | Gil'burd, Syrvatka, et al., 1967 |

References

Gil'burd, Syrvatka, et al., 1967
Gil'burd, M.M.; Syrvatka, B.G.; Shevchuk, V.U.; Bel'ferman, A.L.; Moin, F.B.,
Mass spectrometric study of fluorine-containing compounds. I. Comparative study of methylacetylene and difluoromethylacetylene,
High Energy Chem., 1967, 1, 359, In original 411. [all data]