1,1,1-trimethyldisilane
- Formula: C3H12Si2
- Molecular weight: 104.2984
- IUPAC Standard InChIKey: ZVGUNGATIFIZOL-UHFFFAOYSA-N
- CAS Registry Number: 18365-32-7
- Chemical structure:
View 3d structure (requires JavaScript / HTML 5) - Other names: Disilane, 1,1,1-trimethyl-

Gas phase ion energetics data

Data compiled by: Sharon G. Lias, Rhoda D. Levin, and Sherif A. Kafafi
Appearance energy determinations
Ion | AE (eV) | Other Products | Method | Reference | Comment |
---|---|---|---|---|---|
C3H9Si+ | 9.7 ± 0.1 | SiH3 | EI | Potzinger, Ritter, et al., 1975 |

References

Potzinger, Ritter, et al., 1975
Potzinger, P.; Ritter, A.; Krause, J.,
Massenspektrometrische Bestimmung von Bindungsenergien in siliciumorganischen Verbindungen,
Z. Naturforsch. A:, 1975, 30, 347. [all data]