N-Methyl-3-pyridinamine
- Formula: C6H8N2
- Molecular weight: 108.1411
- IUPAC Standard InChIKey: DBGFNLVRAFYZBI-UHFFFAOYSA-N
- CAS Registry Number: 18364-47-1
- Chemical structure:
View 3d structure (requires JavaScript / HTML 5) - Permanent link for this species. Use this link for bookmarking this species for future reference.

Phase change data

Data compiled by: William E. Acree, Jr., James S. Chickos
Enthalpy of vaporization
ΔvapH (kJ/mol) | Temperature (K) | Method | Reference | Comment |
---|---|---|---|---|
57.2 | 326. | A | Stephenson and Malanowski, 1987 | Based on data from 313. to 343. K. |

Gas phase ion energetics data

Data compiled as indicated in comments:
LLK - Sharon G. Lias, Rhoda D. Levin, and Sherif A. Kafafi
Ionization energy determinations
IE (eV) | Method | Reference | Comment |
---|---|---|---|
8.53 ± 0.05 | EI | Gronneberg and Undheim, 1973 | LLK |

References

Stephenson and Malanowski, 1987
Stephenson, Richard M.; Malanowski, Stanislaw,
Handbook of the Thermodynamics of Organic Compounds, 1987, https://doi.org/10.1007/978-94-009-3173-2
. [all data]
Gronneberg and Undheim, 1973
Gronneberg, T.; Undheim, K.,
Mass spectrometry of onium compounds - XV. ionization potentials of amino pyridines,
Tetrahedron Lett., 1973, 3193. [all data]