Tetrafluorophthalonitrile
- Formula: C8F4N2
- Molecular weight: 200.0926
- IUPAC Standard InChIKey: OFLRJMBSWDXSPG-UHFFFAOYSA-N
- CAS Registry Number: 1835-65-0
- Chemical structure:
View 3d structure (requires JavaScript / HTML 5) - Other names: 1,2-Benzenedicarbonitrile, 3,4,5,6-tetrafluoro-; 3,4,5,6-tetrafluorobenzene-1,2-dicarbonitrile

Gas phase ion energetics data

Data compiled by: Sharon G. Lias, Rhoda D. Levin, and Sherif A. Kafafi
Ionization energy determinations
IE (eV) | Method | Reference | Comment |
---|---|---|---|
10.60 | PE | Neijzen and DeLange, 1978 | Vertical value |

References

Neijzen and DeLange, 1978
Neijzen, B.J.M.; DeLange, C.A.,
Photoelectron spectroscopy of mono-dicyanobenzenes their perfluoro derivatives,
J. Electron Spectrosc. Relat. Phenom., 1978, 14, 187. [all data]