Propionaldehyde ethylimine
- Formula: C5H11N
- Molecular weight: 85.1475
- IUPAC Standard InChIKey: ZVYCPFCNAXPUFP-AATRIKPKSA-N
- CAS Registry Number: 18328-91-1
- Chemical structure:
View 3d structure (requires JavaScript / HTML 5) - Species with the same structure:

Reaction thermochemistry data

Data compiled by: Hussein Y. Afeefy, Joel F. Liebman, and Stephen E. Stein
Individual Reactions
By formula: H2 + C5H11N = C5H13N
Quantity | Value | Units | Method | Reference | Comment |
---|---|---|---|---|---|
ΔrH° | 93.7 ± 0.4 | kJ/mol | Cm | Jackman and Packham, 1957 | liquid phase; solvent: bis-2-Ethoxyethyl ether |

Gas phase ion energetics data

Data compiled as indicated in comments:
LLK - Sharon G. Lias, Rhoda D. Levin, and Sherif A. Kafafi
Ionization energy determinations
IE (eV) | Method | Reference | Comment |
---|---|---|---|
8.7 | PE | Vocelle, Dargelos, et al., 1977 | LLK |
9.45 | PE | Vocelle, Dargelos, et al., 1977 | Vertical value; LLK |

References

Jackman and Packham, 1957
Jackman, L.M.; Packham, D.I.,
The experimental resonance energy of acridine,
Proc. Chem. Soc., London, 1957, 349-350. [all data]
Vocelle, Dargelos, et al., 1977
Vocelle, D.; Dargelos, A.; Pottier, R.; Sandorfy, C.,
Photoelectron and far-ultraviolet absorption spectra of nonaromatic azomethine compounds,
J. Chem. Phys., 1977, 66, 2860. [all data]