Benzenebutanal
- Formula: C10H12O
- Molecular weight: 148.2017
- IUPAC Standard InChIKey: NHFRGTVSKOPUBK-UHFFFAOYSA-N
- CAS Registry Number: 18328-11-5
- Chemical structure:
View 3d structure (requires JavaScript / HTML 5) - Other names: Butyraldehyde, 4-phenyl-; γ-Phenylbutyraldehyde; 4-Phenylbutanal; 4-Phenylbutyraldehyde

Gas phase ion energetics data

Data compiled by: Henry M. Rosenstock, Keith Draxl, Bruce W. Steiner, and John T. Herron
Ionization energy determinations
IE (eV) | Method | Reference |
---|---|---|
8.8 ± 0.1 | EI | Occolowitz, 1967 |
Appearance energy determinations
Ion | AE (eV) | Other Products | Method | Reference | Comment |
---|---|---|---|---|---|
C8H8+ | 9.6 ± 0.2 | CH2CHOH | EI | Occolowitz, 1967 |

References

Occolowitz, 1967
Occolowitz, J.L.,
Charge localization and the electronimpact fragmentation of carbonyl compounds,
Australian J. Chem., 1967, 20, 2387. [all data]