D-Verbenone
- Formula: C10H14O
- Molecular weight: 150.2176
- IUPAC Standard InChIKey: DCSCXTJOXBUFGB-JGVFFNPUSA-N
- CAS Registry Number: 18309-32-5
- Chemical structure:
View 3d structure (requires JavaScript / HTML 5) - Stereoisomers:
- Other names: Bicyclo[3.1.1]hept-3-en-2-one, 4,6,6-trimethyl-, (1R)-; 2-Pinen-4-one, (1R,5R)-(+)-; (+)-Verbenone; Bicyclo[3.1.1]hept-3-en-2-one, 4,6,6-trimethyl-, (1R-cis)-; Verbenone; Verbenone, (+)-; (1R-cis)-4,6,6-Trimethylbicyclo(3.1.1)hept-3-ene-2-one; Verbenone, (d)-; (1R-cis)-4,6,6-Trimethylbicyclo(3.1.1)hept-3-en-2-one; Verbinone; (R)-(+)-Verbenone; 4,6,6-Trimethylbicyclo[3.1.1]hept-3-en-2-one, (1R-cis)-; 4,6,6-Trimethylbicyclo[3.1.1]hept-3-en-2-one, (1R,5R)-; NSC 36846; (1R)-4,6,6-trimethylbicyclo[3.1.1]hept-3-en-2-one

Gas phase ion energetics data

Data compiled by: Henry M. Rosenstock, Keith Draxl, Bruce W. Steiner, and John T. Herron
Ionization energy determinations
IE (eV) | Method | Reference |
---|---|---|
9.83 | EI | Bunau, Schade, et al., 1967 |
Appearance energy determinations
Ion | AE (eV) | Other Products | Method | Reference | Comment |
---|---|---|---|---|---|
C9H11O+ | 10.8 | CH3 | EI | Bunau, Schade, et al., 1967 |

Phase change data

Data compiled by: Robert L. Brown and Stephen E. Stein
Quantity | Value | Units | Method | Reference | Comment |
---|---|---|---|---|---|
Tboil | 500.7 | K | N/A | Weast and Grasselli, 1989 |

Normal alkane RI, non-polar column, temperature ramp

View large format table.

Column type Active phase I Reference Comment
CapillaryZP-51228.Füssel, Dötterl, et al., 200760. m/0.25 mm/0.25 μm, He, 40. C @ 7. min, 6. K/min, 260. C @ 1. min

Normal alkane RI, non-polar column, custom temperature program

View large format table.

Column type Active phase I Reference Comment
CapillaryDB-11170.Touafek, Nacer, et al., 200430. m/0.25 mm/0.25 μm, He; Program: 45C => 3C/min => 175C => 15C/min => 300C (15min)

References

Bunau, Schade, et al., 1967
Bunau, G.v.; Schade, G.; Gollnick, K.,
Massenspektrometrische Untersuchungen von Terpenen. I.Monoterpenaldehyde und -ketone,
Z. Anal. Chem., 1967, 227, 173. [all data]