Cyclohexanone, 5-methyl-2-(1-methylethyl)-, (2S-cis)-
- Formula: C10H18O
- Molecular weight: 154.2493
- IUPAC Standard InChIKey: NFLGAXVYCFJBMK-RKDXNWHRSA-N
- CAS Registry Number: 18309-28-9
- Chemical structure:
View 3d structure (requires JavaScript / HTML 5) - Species with the same structure:
- Stereoisomers:
- Other names: p-Menthan-3-one, (1S,4S)-(-)-; L-Isomenthone; Isomenthone, (-)-; d-Isomenthone; 2-Isopropyl-5-methylcyclohexanone-, (2S-cis)-; Isomenthone, (1S,4S)-; (2S-cis)-2-(isopropyl)-5-methylcyclohexan-1-one; Isomenthone

Gas phase ion energetics data

Data compiled by: Henry M. Rosenstock, Keith Draxl, Bruce W. Steiner, and John T. Herron
Ionization energy determinations
IE (eV) | Method | Reference |
---|---|---|
9.86 | EI | Bunau, Schade, et al., 1967 |
Appearance energy determinations
Ion | AE (eV) | Other Products | Method | Reference | Comment |
---|---|---|---|---|---|
C9H15O+ | 11.4 | CH3 | EI | Bunau, Schade, et al., 1967 |

References

Bunau, Schade, et al., 1967
Bunau, G.v.; Schade, G.; Gollnick, K.,
Massenspektrometrische Untersuchungen von Terpenen. I.Monoterpenaldehyde und -ketone,
Z. Anal. Chem., 1967, 227, 173. [all data]