Stannic oxide
- Formula: O2Sn
- Molecular weight: 150.709
- IUPAC Standard InChIKey: XOLBLPGZBRYERU-UHFFFAOYSA-N
- CAS Registry Number: 18282-10-5
- Chemical structure:
View 3d structure (requires JavaScript / HTML 5) - Other names: tin dioxide

Condensed phase thermochemistry data

Quantity | Value | Units | Method | Reference | Comment |
---|---|---|---|---|---|
ΔfH°solid | -577.63 ± 0.20 | kJ/mol | Review | Cox, Wagman, et al., 1984 | tetragonal phase; CODATA Review value |
Quantity | Value | Units | Method | Reference | Comment |
S°solid,1 bar | 49.04 ± 0.10 | J/mol*K | Review | Cox, Wagman, et al., 1984 | tetragonal phase; CODATA Review value |

Vibrational and/or electronic energy levels

Data compiled by: Marilyn E. Jacox
State: X
Vib. sym. |
No. | Approximate type of mode |
cm-1 | Med. | Method | References | |
---|---|---|---|---|---|---|---|
Σu+ | 3 | Asym. stretch | 863.1 | Kr | IR | Bos and Ogden, 1973 | |
3 | Asym. stretch | 877.8 | N2 | IR | Bos and Ogden, 1973 | ||
Additional references: Jacox, 1998, page 189

References

Cox, Wagman, et al., 1984
Cox, J.D.; Wagman, D.D.; Medvedev, V.A.,
CODATA Key Values for Thermodynamics, Hemisphere Publishing Corp., New York, 1984, 1. [all data]
Bos and Ogden, 1973
Bos, A.; Ogden, J.S.,
Matrix isolation infrared study of the reaction between tin vapor and molecular oxygen. Characterization of molecular tin dioxide,
J. Phys. Chem., 1973, 77, 12, 1513, https://doi.org/10.1021/j100631a009
. [all data]
Jacox, 1998
Jacox, M.E.,
Vibrational and electronic energy levels of polyatomic transient molecules: supplement A,
J. Phys. Chem. Ref. Data, 1998, 27, 2, 115-393, https://doi.org/10.1063/1.556017
. [all data]