(E,E)-2,4-Hexadiene, 3,4-dimethyl-
- Formula: C8H14
- Molecular weight: 110.1968
- IUPAC Standard InChIKey: PBGBMQLUDCDJQJ-KQQUZDAGSA-N
- CAS Registry Number: 18265-39-9
- Chemical structure:
View 3d structure (requires JavaScript / HTML 5) - Stereoisomers:

Gas phase thermochemistry data

Data compiled by: Hussein Y. Afeefy, Joel F. Liebman, and Stephen E. Stein
Quantity | Value | Units | Method | Reference | Comment |
---|---|---|---|---|---|
ΔfH°gas | -2.3 | kJ/mol | Chyd | Roth, Lennartz, et al., 1988 |

Phase change data

Data compiled by: Thermodynamics Research Center, NIST Boulder Laboratories, Chris Muzny director
Quantity | Value | Units | Method | Reference | Comment |
---|---|---|---|---|---|
Tboil | 407.15 | K | N/A | Reeve and Reichel, 1972 | Uncertainty assigned by TRC = 1.5 K |

Reaction thermochemistry data

Data compiled by: Hussein Y. Afeefy, Joel F. Liebman, and Stephen E. Stein
Individual Reactions
By formula: 2H2 + C8H14 = C8H18
Quantity | Value | Units | Method | Reference | Comment |
---|---|---|---|---|---|
ΔrH° | -209.1 ± 0.3 | kJ/mol | Chyd | Roth, Lennartz, et al., 1988 | liquid phase; solvent: Isooctane |

Gas phase ion energetics data

Data compiled as indicated in comments:
LBLHLM - Sharon G. Lias, John E. Bartmess, Joel F. Liebman, John L. Holmes, Rhoda D. Levin, and W. Gary Mallard
Ionization energy determinations
IE (eV) | Method | Reference | Comment |
---|---|---|---|
7.8 | PE | Honegger, Zhong-zhi, et al., 1984 | LBLHLM |

References

Roth, Lennartz, et al., 1988
Roth, W.R.; Lennartz, H-W.; Doering, W.v.E.; Dolbier, W.R., Jr.; Schmidhauser, J.C.,
Thermochemistry of the "orthogonal" butadienes (Z,Z)-3,4-dimethylhexa-2,4-diene and 2,3-di-tert-butylbuta-1,3-diene,
J. Am. Chem. Soc., 1988, 110, 1883-1889. [all data]
Reeve and Reichel, 1972
Reeve, W.; Reichel, D.M.,
Dehydration of 3,4-Dimethyl-3-hexanediol to the Six Possible C8H14 Dienes and Proof of Structure of the Substituted Btadienes,
J. Org. Chem., 1972, 37, 68. [all data]
Honegger, Zhong-zhi, et al., 1984
Honegger, E.; Zhong-zhi, Y.; Heilbronner, E.; Doering, W.V.E.; Schmidhauser, J.C.,
Photoelectron-spectroscopic characterization of 3,4-dimethyl-2,4-hexadienes,
Helv. Chim. Acta, 1984, 67, 640. [all data]