n-Propyl mercuric iodide
- Formula: C3H7HgI
- Molecular weight: 370.58
- CAS Registry Number: 18257-69-7

Condensed phase thermochemistry data

Data compiled by: José A. Martinho Simões
Quantity | Value | Units | Method | Reference | Comment |
---|---|---|---|---|---|
ΔfH°solid | -91.6 ± 2.8 | kJ/mol | Review | Martinho Simões | The enthalpy of formation relies on -24.9 ± 5.0 kJ/mol for the enthalpy of formation of Hg(Pr)2(l). |

Gas phase ion energetics data

Data compiled by: Sharon G. Lias and Joel F. Liebman
Ionization energy determinations
IE (eV) | Method | Reference |
---|---|---|
8.8 ± 0.2 | PI | Nekrasov, Zagorevskii, et al., 1992 |

Reaction thermochemistry data

Data compiled by: José A. Martinho Simões

Individual Reactions

C6H14Hg (l) + Mercury diiodide (cr) = 2C3H7HgI (cr)

By formula: C6H14Hg (l) + HgI2 (cr) = 2C3H7HgI (cr)

Quantity Value Units Method Reference Comment
Δr-52.9 ± 1.7kJ/molRSCMortimer, Pritchard, et al., 1952Please also see Pedley and Rylance, 1977 and Cox and Pilcher, 1970.

References

Martinho Simões
Martinho Simões, J.A.,
Private communication (see http://webbook.nist.gov/chemistry/om/). [all data]
Nekrasov, Zagorevskii, et al., 1992
Nekrasov, Y.S.; Zagorevskii, D.V.; Mikeladze, M.S.,
Mass spectrometry of organomercury compounds,
Organomet. Chem. USSR, 1992, 5, 237, In original 499. [all data]