2-Pyridinamine, 6-methyl-
- Formula: C6H8N2
- Molecular weight: 108.1411
- IUPAC Standard InChIKey: QUXLCYFNVNNRBE-UHFFFAOYSA-N
- CAS Registry Number: 1824-81-3
- Chemical structure:
View 3d structure (requires JavaScript / HTML 5) - Other names: 2-Picoline, 6-amino-; 2-Amino-6-methylpyridine; 2-Amino-6-picoline; 6-Amino-2-methylpyridine; 6-Amino-2-picoline; 6-Methyl-2-pyridinamine; 6-Methyl-2-pyridylamine; Pyridine, 2-amino-6-methyl-; 6-Methyl-2-aminopyridine; NSC 1488; NSC 6971

Phase change data

Data compiled by: Robert L. Brown and Stephen E. Stein
Quantity | Value | Units | Method | Reference | Comment |
---|---|---|---|---|---|
Tboil | 481.7 | K | N/A | Weast and Grasselli, 1989 | |
Tboil | 481. to 482. | K | N/A | Buckingham and Donaghy, 1982 | |
Quantity | Value | Units | Method | Reference | Comment |
Tfus | 314. | K | N/A | Buckingham and Donaghy, 1982 |

Gas phase ion energetics data

Data compiled by: Sharon G. Lias, Rhoda D. Levin, and Sherif A. Kafafi
Ionization energy determinations
IE (eV) | Method | Reference |
---|---|---|
9.1 | CTS | Daisey and Sonnessa, 1972 |

Van Den Dool and Kratz RI, non-polar column, temperature ramp

Column type | Active phase | I | Reference | Comment |
---|---|---|---|---|
Capillary | DB-5 | 1074. | Premecz and Ford, 1987 | He, 60. C @ 10. min, 10. K/min, 280. C @ 3. min; Column length: 30. m; Column diameter: 0.32 mm |

Van Den Dool and Kratz RI, polar column, temperature ramp

Column type | Active phase | I | Reference | Comment |
---|---|---|---|---|
Capillary | CAM | 1893. | Premecz and Ford, 1987 | He, 60. C @ 5. min, 5. K/min, 240. C @ 21. min; Column length: 15. m; Column diameter: 0.24 mm |

References

Weast and Grasselli, 1989
CRC Handbook of Data on Organic Compounds, 2nd Editon, Weast,R.C and Grasselli, J.G., ed(s)., CRC Press, Inc., Boca Raton, FL, 1989, 1. [all data]
Buckingham and Donaghy, 1982
Buckingham, J.; Donaghy, S.M.,
Dictionary of Organic Compounds: Fifth Edition, Chapman and Hall, New York, 1982, 1. [all data]
Daisey and Sonnessa, 1972
Daisey, J.M.; Sonnessa, A.J.,
A study of the thermodynamic and spectral properties of molecular complexes of iodine with several aminopyridines,
J. Phys. Chem., 1972, 76, 1895. [all data]
Lang (editor), 1970
Lang (editor), L.,
Absorption Spectra in the Ultraviolet and Visible Region, 1970, 14, 187. [all data]
Premecz and Ford, 1987
Premecz, J.E.; Ford, M.E.,
Gas chromatographic separation of substituted pyridines,
J. Chromatogr., 1987, 388, 23-35, https://doi.org/10.1016/S0021-9673(01)94463-2
. [all data]