Ethyne, 1-bromo-2-trimethylsilyl-
- Formula: C5H9BrSi
- Molecular weight: 177.114
- IUPAC Standard InChIKey: YRBAQEQNCDDFKM-UHFFFAOYSA-N
- CAS Registry Number: 18243-59-9
- Chemical structure:
View 3d structure (requires JavaScript / HTML 5) - Permanent link for this species. Use this link for bookmarking this species for future reference.

Gas phase ion energetics data

Data compiled by: Sharon G. Lias, Rhoda D. Levin, and Sherif A. Kafafi
Ionization energy determinations
IE (eV) | Method | Reference |
---|---|---|
9.4 ± 0.1 | PE | Bieri, Brogli, et al., 1973 |

References

Bieri, Brogli, et al., 1973
Bieri, G.; Brogli, F.; Heilbronner, E.; Kloster-Jensen, E.,
A photoelectron spectroscopic investigation of the electronic structure of trimethylsilylhaloacetylenes,
J. Electron Spectrosc. Relat. Phenom., 1973, 1, 67. [all data]