Isopropylsilane
- Formula: C3H10Si
- Molecular weight: 74.1970
- IUPAC Standard InChIKey: YYVGYULIMDRZMJ-UHFFFAOYSA-N
- CAS Registry Number: 18230-84-7
- Chemical structure:
View 3d structure (requires JavaScript / HTML 5) - Permanent link for this species. Use this link for bookmarking this species for future reference.

Gas phase ion energetics data

Data compiled by: Henry M. Rosenstock, Keith Draxl, Bruce W. Steiner, and John T. Herron
Ionization energy determinations
IE (eV) | Method | Reference |
---|---|---|
9.9 ± 0.1 | EI | Steele, Nichols, et al., 1962 |
Appearance energy determinations
Ion | AE (eV) | Other Products | Method | Reference | Comment |
---|---|---|---|---|---|
C3H6+ | 10.81 ± 0.04 | ? | EI | Steele, Nichols, et al., 1962 | |
C3H7+ | 11.33 ± 0.03 | ? | EI | Steele, Nichols, et al., 1962 | |
SiH3+ | 13.1 ± 0.2 | ? | EI | Steele, Nichols, et al., 1962 |

References

Steele, Nichols, et al., 1962
Steele, W.C.; Nichols, L.D.; Stone, F.G.A.,
The determination of silicon-carbon and silicon-hydrogen bond dissociation energies by electron impact,
J. Am. Chem. Soc., 1962, 84, 4441. [all data]