Benzene, (ethenylthio)-
- Formula: C8H8S
- Molecular weight: 136.214
- IUPAC Standard InChIKey: GMPDOIGGGXSAPL-UHFFFAOYSA-N
- CAS Registry Number: 1822-73-7
- Chemical structure:
View 3d structure (requires JavaScript / HTML 5) - Other names: Phenylthioethene; Phenylthioethylene; Phenyl vinyl sulfide; Phenyl vinyl thioether; Sulfide, phenyl vinyl; Vinyl phenyl sulfide; Vinylthiobenzene; (Vinylsulfanyl)benzene; (Ethenylthio)benzene; Phenyl vinyl sulphide

Phase change data

Data compiled by: Robert L. Brown and Stephen E. Stein
Reduced pressure boiling point
Tboil (K) | Pressure (bar) | Reference |
---|---|---|
367.7 | 0.033 | Aldrich Chemical Company Inc., 1990 |

Gas phase ion energetics data

Data compiled by: Sharon G. Lias, Rhoda D. Levin, and Sherif A. Kafafi
Ionization energy determinations
IE (eV) | Method | Reference |
---|---|---|
7.96 ± 0.01 | PI | Trofimov, Mel'der, et al., 1975 |

Kovats' RI, non-polar column, isothermal

Column type | Active phase | Temperature (C) | I | Reference | Comment |
---|---|---|---|---|---|
Packed | Apiezon M | 130. | 1141. | Garbuzov, Misharina, et al., 1985 | He or N2, Chromosorb W, AW-DMCS; Column length: 2.1 m |
Packed | Apiezon M | 130. | 1141. | Golovnya, Garbuzov, et al., 1978 | Chromosorb W, AW/DMS; Column length: 2.1 m |

References

Aldrich Chemical Company Inc., 1990
Aldrich Chemical Company Inc.,
Catalog Handbook of Fine Chemicals, Aldrich Chemical Company, Inc., Milwaukee WI, 1990, 1. [all data]
Trofimov, Mel'der, et al., 1975
Trofimov, B.A.; Mel'der, U.K.; Pikver, R.I.; Vyalykh, E.P.,
Ionization potentials of unsaturated and sulfides the participation of neighboring multiple bonds of heteroatoms in the stabilization of the radical cation,
Teor. Eksp. Khim., 1975, 11, 129. [all data]
Garbuzov, Misharina, et al., 1985
Garbuzov, V.G.; Misharina, T.A.; Aerov, A.F.; Golovnya, R.V.,
Gas chromatographic retention indices for sulphur(II)-containing organic substances,
J. Anal. Chem. USSR (Engl. Transl.), 1985, 40, 4, 576-586. [all data]
Golovnya, Garbuzov, et al., 1978
Golovnya, R.V.; Garbuzov, V.G.; Aerov, A.F.,
Gas chromatographic characterization of sulfur-containing compounds. 5. Thiophene, furan, and benzene derivatives,
Izv. Akad. Nauk SSSR Ser. Khim., 1978, 11, 2271-2274. [all data]