5-Methyltryptamine
- Formula: C11H14N2
- Molecular weight: 174.2423
- IUPAC Standard InChIKey: PYOUAIQXJALPKW-UHFFFAOYSA-N
- CAS Registry Number: 1821-47-2
- Chemical structure:
View 3d structure (requires JavaScript / HTML 5) - Other names: 1H-Indole-3-ethanamine, 5-methyl; Indole, 3-(aminoethyl)-5-methyl-; 5-Methyl-3-(aminoethyl)indole; Tryptamine, 5-methyl

Gas phase ion energetics data

Data compiled as indicated in comments:
LLK - Sharon G. Lias, Rhoda D. Levin, and Sherif A. Kafafi
Ionization energy determinations
IE (eV) | Method | Reference | Comment |
---|---|---|---|
7.6 | PE | Domelsmith, Munchausen, et al., 1977 | LLK |
7.64 ± 0.05 | PE | Domelsmith, Munchausen, et al., 1977 | Vertical value; LLK |

Normal alkane RI, non-polar column, custom temperature program

Column type | Active phase | I | Reference | Comment |
---|---|---|---|---|
Other | Methyl Silicone | 1795. | Ardrey and Moffat, 1981 | Program: not specified |

References

Domelsmith, Munchausen, et al., 1977
Domelsmith, L.N.; Munchausen, L.L.; Houk, K.N.,
Photoelectron spectra of psychotropic drugs. 1. Phenethylamines, tryptamines, and LSD,
J. Am. Chem. Soc., 1977, 99, 4311. [all data]
Ardrey and Moffat, 1981
Ardrey, R.E.; Moffat, A.C.,
Gas-liquid chromatographic retention indices of 1318 substances of toxicological interest on SE-30 or OV-1 stationary phase,
J. Chromatogr., 1981, 220, 3, 195-252, https://doi.org/10.1016/S0021-9673(00)81925-1
. [all data]