N-Phenylcyclohexylamine
- Formula: C12H17N
- Molecular weight: 175.2701
- IUPAC Standard InChIKey: TXTHKGMZDDTZFD-UHFFFAOYSA-N
- CAS Registry Number: 1821-36-9
- Chemical structure:
View 3d structure (requires JavaScript / HTML 5) - Other names: N-Cyclohexylaniline; Benzenamine, N-cyclohexyl-; Aniline, N-cyclohexyl-; Cyclohexanamine, N-phenyl-; Cyclohexylamine, N-phenyl-; Diphenylamine, ar-hexahydro-; Cyclohexylphenylamine; N-Cyclohexylbenzenamine; Phenylcyclohexylamine; NSC 27510

Phase change data

Data compiled by: Robert L. Brown and Stephen E. Stein
Reduced pressure boiling point
Tboil (K) | Pressure (bar) | Reference |
---|---|---|
464.7 | 0.097 | Weast and Grasselli, 1989 |

Gas phase ion energetics data

Data compiled by: Henry M. Rosenstock, Keith Draxl, Bruce W. Steiner, and John T. Herron
Ionization energy determinations
IE (eV) | Method | Reference |
---|---|---|
7.45 | CTS | Briegleb and Czekalla, 1959 |

References

Weast and Grasselli, 1989
CRC Handbook of Data on Organic Compounds, 2nd Editon, Weast,R.C and Grasselli, J.G., ed(s)., CRC Press, Inc., Boca Raton, FL, 1989, 1. [all data]
Briegleb and Czekalla, 1959
Briegleb, G.; Czekalla, J.,
Die Bestimmung von lonisierungsenergien aus den Spektren von Elektronenubergangskomplexen,
Z.Elektrochem., 1959, 63, 6. [all data]