Benzenebutanoic acid
- Formula: C10H12O2
- Molecular weight: 164.2011
- IUPAC Standard InChIKey: OBKXEAXTFZPCHS-UHFFFAOYSA-N
- CAS Registry Number: 1821-12-1
- Chemical structure:
View 3d structure (requires JavaScript / HTML 5) - Other names: Butyric acid, 4-phenyl-; γ-Phenylbutyric acid; Phenylbutyric acid; 4-Phenylbutanoic acid; 4-Phenylbutyric acid; γ-Phenyl-n-butyric acid; 4-Phenyl-n-butyric acid; ω-Phenylbutanoic acid; Benzenebutyric acid

Phase change data

Data compiled as indicated in comments:
BS - Robert L. Brown and Stephen E. Stein
AC - William E. Acree, Jr., James S. Chickos
Quantity | Value | Units | Method | Reference | Comment |
---|---|---|---|---|---|
Tboil | 563.2 | K | N/A | Weast and Grasselli, 1989 | BS |
Quantity | Value | Units | Method | Reference | Comment |
ΔsubH° | 113.0 ± 1.0 | kJ/mol | ME | Monte and Hillesheim, 2001 | AC |
Reduced pressure boiling point
Tboil (K) | Pressure (bar) | Reference | Comment |
---|---|---|---|
438.2 | 0.013 | Aldrich Chemical Company Inc., 1990 | BS |
Enthalpy of sublimation
ΔsubH (kJ/mol) | Temperature (K) | Method | Reference | Comment |
---|---|---|---|---|
112.4 ± 0.8 | 316. | ME | Monte and Hillesheim, 2001 | Based on data from 309. to 323. K.; AC |
Enthalpy of fusion
ΔfusH (kJ/mol) | Temperature (K) | Method | Reference | Comment |
---|---|---|---|---|
19.5 | 324.2 | DSC | Monte and Hillesheim, 2001 | AC |

Gas phase ion energetics data

Data compiled by: Henry M. Rosenstock, Keith Draxl, Bruce W. Steiner, and John T. Herron
Ionization energy determinations
IE (eV) | Method | Reference |
---|---|---|
9.0 ± 0.1 | EI | Occolowitz, 1967 |
Appearance energy determinations
Ion | AE (eV) | Other Products | Method | Reference | Comment |
---|---|---|---|---|---|
C8H8+ | 10.6 ± 0.2 | CH2=CO+H2O | EI | Occolowitz, 1967 | |
C10H10O+ | 9.2 ± 0.2 | H2O | EI | Occolowitz, 1967 |

Van Den Dool and Kratz RI, non-polar column, temperature ramp

Column type | Active phase | I | Reference | Comment |
---|---|---|---|---|
Packed | SE-30 | 1417. | Peng, Ding, et al., 1988 | He, Supelcoport and Chromosorb, 40. C @ 4. min, 10. K/min, 250. C @ 60. min; Column length: 3.05 m |

Lee's RI, non-polar column, custom temperature program

Column type | Active phase | I | Reference | Comment |
---|---|---|---|---|
Capillary | Methyl Silicone | 244.61 | Eckel, Ross, et al., 1993 | Program: not specified |

References

Weast and Grasselli, 1989
CRC Handbook of Data on Organic Compounds, 2nd Editon, Weast,R.C and Grasselli, J.G., ed(s)., CRC Press, Inc., Boca Raton, FL, 1989, 1. [all data]
Monte and Hillesheim, 2001
Monte, Manuel J.S.; Hillesheim, Dorothea M.,
Thermodynamic Study on the Sublimation of 2-Phenylacetic, 4-Phenylbutyric, and 5-Phenylvaleric Acid,
J. Chem. Eng. Data, 2001, 46, 6, 1601-1604, https://doi.org/10.1021/je010153h
. [all data]
Aldrich Chemical Company Inc., 1990
Aldrich Chemical Company Inc.,
Catalog Handbook of Fine Chemicals, Aldrich Chemical Company, Inc., Milwaukee WI, 1990, 1. [all data]
Occolowitz, 1967
Occolowitz, J.L.,
Charge localization and the electronimpact fragmentation of carbonyl compounds,
Australian J. Chem., 1967, 20, 2387. [all data]
Peng, Ding, et al., 1988
Peng, C.T.; Ding, S.F.; Hua, R.L.; Yang, Z.C.,
Prediction of Retention Indexes I. Structure-Retention Index Relationship on Apolar Columns,
J. Chromatogr., 1988, 436, 137-172, https://doi.org/10.1016/S0021-9673(00)94575-8
. [all data]
Eckel, Ross, et al., 1993
Eckel, W.P.; Ross, B.; Isensee, R.K.,
Pentobarbital found in ground water,
Ground Water, 1993, 31, 5, 801-804, https://doi.org/10.1111/j.1745-6584.1993.tb00853.x
. [all data]