Ethanone,2,2,2-trifluoro-1-(2-furanyl)-
- Formula: C6H3F3O2
- Molecular weight: 164.0820
- IUPAC Standard InChIKey: MAZDPKNERLXXOV-UHFFFAOYSA-N
- CAS Registry Number: 18207-47-1
- Chemical structure:
View 3d structure (requires JavaScript / HTML 5) - Permanent link for this species. Use this link for bookmarking this species for future reference.

Gas phase ion energetics data

Data compiled by: Sharon G. Lias, Rhoda D. Levin, and Sherif A. Kafafi
Ionization energy determinations
IE (eV) | Method | Reference |
---|---|---|
9.77 ± 0.05 | EI | Linda, Marino, et al., 1971 |

References

Linda, Marino, et al., 1971
Linda, P.; Marino, G.; Pignataro, S.,
A comparison of sensitivities to substituent effects of five- membered heteroaromatic rings in gas phase ionization,
J. Chem. Soc. B, 1971, 1585. [all data]