Silane, 2-propenyl-
- Formula: C3H8Si
- Molecular weight: 72.1811
- IUPAC Standard InChIKey: DNAJDTIOMGISDS-UHFFFAOYSA-N
- CAS Registry Number: 18191-59-8
- Chemical structure:
View 3d structure (requires JavaScript / HTML 5) - Permanent link for this species. Use this link for bookmarking this species for future reference.

Gas phase ion energetics data

Data compiled by: Sharon G. Lias, Rhoda D. Levin, and Sherif A. Kafafi
Ionization energy determinations
IE (eV) | Method | Reference | Comment |
---|---|---|---|
9.49 | PE | Mollere, Bock, et al., 1972 | Vertical value |

References

Mollere, Bock, et al., 1972
Mollere, P.; Bock, H.; Becker, G.; Fritz, G.,
Photoelectron spectra and molecular properties. XV. The effects of α- and β-silyl substituents on π-systems,
J. Organomet. Chem., 1972, 46, 89. [all data]