trans-1,2-Bis(trimethylsilyl)ethylene
- Formula: C8H20Si2
- Molecular weight: 172.4154
- IUPAC Standard InChIKey: AMGXUPKDZBCKPF-BQYQJAHWSA-N
- CAS Registry Number: 18178-59-1
- Chemical structure:
View 3d structure (requires JavaScript / HTML 5) - Other names: Silane, 1,2-ethenediylbis[trimethyl]-,(E)-; Trimethyl[(E)-2-(trimethylsilyl)ethenyl]silane; 1,2-bis-Trimethylsilylethylene, (trans); Bis-trimethylsilylethylene (trans)

Gas phase ion energetics data

Data compiled as indicated in comments:
LLK - Sharon G. Lias, Rhoda D. Levin, and Sherif A. Kafafi
RDSH - Henry M. Rosenstock, Keith Draxl, Bruce W. Steiner, and John T. Herron
Ionization energy determinations
IE (eV) | Method | Reference | Comment |
---|---|---|---|
9.32 ± 0.04 | EI | Bock and Seidl, 1968 | RDSH |
9.19 | PE | Ensslin, Schmidtke, et al., 1977 | Vertical value; LLK |

References

Bock and Seidl, 1968
Bock, H.; Seidl, H.,
d-Orbitaleffekte in siliziumsubstituierten π-Elektronensystemen. VI. Spektroskopische Untersuchungen an Alkyl- und Silylathylenen,
J. Organometal. Chem., 1968, 13, 87. [all data]
Ensslin, Schmidtke, et al., 1977
Ensslin, W.; Schmidtke, H.-H.; Kuhn, Th.,
Photoelectron spectra and electronic structure of symmetrically trans-substituted disilylethylenes,
Inorg. Chim. Acta, 1977, 24, 159. [all data]