Benzene, 1-nitro-4-(phenylmethyl)-
- Formula: C13H11NO2
- Molecular weight: 213.2319
- IUPAC Standard InChIKey: IDSGFSCSMXRJON-UHFFFAOYSA-N
- CAS Registry Number: 1817-77-2
- Chemical structure:
View 3d structure (requires JavaScript / HTML 5) - Other names: Methane, (p-nitrophenyl)phenyl-; (p-Nitrophenyl)phenylmethane; p-Nitrodiphenylmethane; 4-Nitrodiphenylmethane

Gas phase ion energetics data

Data compiled by: Sharon G. Lias, Rhoda D. Levin, and Sherif A. Kafafi
Ionization energy determinations
IE (eV) | Method | Reference |
---|---|---|
9.35 ± 0.05 | EI | Pignataro, Mancini, et al., 1972 |
Appearance energy determinations
Ion | AE (eV) | Other Products | Method | Reference | Comment |
---|---|---|---|---|---|
C13H11+ | 10.5 ± 0.1 | NO2 | EI | Innorta, Torroni, et al., 1973 |

Kovats' RI, non-polar column, isothermal

Column type | Active phase | Temperature (C) | I | Reference | Comment |
---|---|---|---|---|---|
Capillary | OV-1 | 200. | 1893.3 | Giumanini, Verardo, et al., 2001 |

Van Den Dool and Kratz RI, non-polar column, temperature ramp

Column type | Active phase | I | Reference | Comment |
---|---|---|---|---|
Capillary | OV-1 | 1933. | Giumanini, Verardo, et al., 2001 | 5. K/min; Tstart: 60. C; Tend: 280. C |

References

Pignataro, Mancini, et al., 1972
Pignataro, S.; Mancini, V.; Innorta, G.; Distefano, G.,
Ionization energies and ring orbital interaction in diarylmethanes and diaryleth,
Z. Naturforsch., 1972, 27, 534. [all data]
Innorta, Torroni, et al., 1973
Innorta, G.; Torroni, S.; Pignataro, S.; Mancini, V.,
The activation energy as guiding factor in the fragmentation of substituted diphenylmethanes,
Org. Mass Spectrom., 1973, 7, 1399. [all data]
Giumanini, Verardo, et al., 2001
Giumanini, A.G.; Verardo, G.; Soják, L.; Kubinec, R.; Perjéssy, A.,
Identification of mononitro and dinitro isomers of diphenylmethane by GC-FT-IR and GC-MS techniques,
Ind. Eng. Chem. Res., 2001, 40, 6, 1449-1453, https://doi.org/10.1021/ie000667u
. [all data]