Tert-butylsilane
- Formula: C4H12Si
- Molecular weight: 88.2236
- IUPAC Standard InChIKey: UNWUYTNKSRTDDC-UHFFFAOYSA-N
- CAS Registry Number: 18165-85-0
- Chemical structure:
View 3d structure (requires JavaScript / HTML 5) - Permanent link for this species. Use this link for bookmarking this species for future reference.

Gas phase ion energetics data

Data compiled by: Henry M. Rosenstock, Keith Draxl, Bruce W. Steiner, and John T. Herron
Ionization energy determinations
IE (eV) | Method | Reference |
---|---|---|
9.5 ± 0.2 | EI | Steele, Nichols, et al., 1962 |
Appearance energy determinations
Ion | AE (eV) | Other Products | Method | Reference | Comment |
---|---|---|---|---|---|
C4H8+ | 9.89 ± 0.05 | ? | EI | Steele, Nichols, et al., 1962 | |
C4H9+ | 10.25 ± 0.02 | ? | EI | Steele, Nichols, et al., 1962 | |
SiH3+ | 13.7 ± 0.2 | ? | EI | Steele, Nichols, et al., 1962 |

References

Steele, Nichols, et al., 1962
Steele, W.C.; Nichols, L.D.; Stone, F.G.A.,
The determination of silicon-carbon and silicon-hydrogen bond dissociation energies by electron impact,
J. Am. Chem. Soc., 1962, 84, 4441. [all data]