N,N-Dimethyl-2-thiooxamide
- Formula: C4H8N2OS
- Molecular weight: 132.184
- IUPAC Standard InChIKey: PNDJQCJQZVHZDQ-UHFFFAOYSA-N
- CAS Registry Number: 18138-14-2
- Chemical structure:
View 3d structure (requires JavaScript / HTML 5) - Species with the same structure:

Gas phase ion energetics data

Data compiled as indicated in comments:
LLK - Sharon G. Lias, Rhoda D. Levin, and Sherif A. Kafafi
Ionization energy determinations
IE (eV) | Method | Reference | Comment |
---|---|---|---|
8.37 | PE | Henriksen, Isaksson, et al., 1981 | Vertical value; LLK |

References

Henriksen, Isaksson, et al., 1981
Henriksen, L.; Isaksson, R.; Liljefors, T.; Sandstrom, J.,
Ultraviolet absorption and photoelectron spectra of some cyclic and open-chain mono- and dithiooxamides,
Acta Chem. Scand., Ser. B, 1981, 35, 489. [all data]