2,5-Disilahex-3-ene, 2,2,5,5-tetramethyl-3-vinyl-, (E)-
- Formula: C10H22Si2
- Molecular weight: 198.4527
- IUPAC Standard InChIKey: NXKKWMIBFUFCRO-MDZDMXLPSA-N
- CAS Registry Number: 18081-31-7
- Chemical structure:
View 3d structure (requires JavaScript / HTML 5) - Permanent link for this species. Use this link for bookmarking this species for future reference.

Gas phase ion energetics data

Data compiled by: Henry M. Rosenstock, Keith Draxl, Bruce W. Steiner, and John T. Herron
Ionization energy determinations
IE (eV) | Method | Reference |
---|---|---|
8.45 ± 0.04 | EI | Bock and Seidl, 1968 |

References

Bock and Seidl, 1968
Bock, H.; Seidl, H.,
'd-Orbital effects' in silicon- substituted π-electron systems. XI. Syntheses and properties of the isomeric bis(trimethylsilyl)-1,3-butadienes,
J. Am. Chem. Soc., 1968, 90, 5694. [all data]