Silane, trimethyl-1-naphthalenyl-
- Formula: C13H16Si
- Molecular weight: 200.3516
- IUPAC Standard InChIKey: KIXIRVPOOYJMDA-UHFFFAOYSA-N
- CAS Registry Number: 18052-80-7
- Chemical structure:
View 3d structure (requires JavaScript / HTML 5) - Other names: Silane, trimethyl-1-naphthyl-; Trimethyl-1-naphthylsilane; 1-(Trimethylsilyl)naphthalene; Trimethyl-1-naphthosilane

Gas phase ion energetics data

Data compiled by: Sharon G. Lias, Rhoda D. Levin, and Sherif A. Kafafi
Ionization energy determinations
IE (eV) | Method | Reference |
---|---|---|
8.03 | CTS | Pitt, Carey, et al., 1972 |

References

Pitt, Carey, et al., 1972
Pitt, C.G.; Carey, R.N.; Toren, E.C.,
Nature of the electronic interactions in aryl-substituted polysilanes,
J. Am. Chem. Soc., 1972, 94, 3806. [all data]