Silane,(2,3-dihydro-1H-inden-1-yl)trimethyl-
- Formula: C12H18Si
- Molecular weight: 190.3568
- IUPAC Standard InChIKey: MYUWOVOJIJYFNC-UHFFFAOYSA-N
- CAS Registry Number: 18036-88-9
- Chemical structure:
View 3d structure (requires JavaScript / HTML 5) - Permanent link for this species. Use this link for bookmarking this species for future reference.

Gas phase ion energetics data

Data compiled as indicated in comments:
LLK - Sharon G. Lias, Rhoda D. Levin, and Sherif A. Kafafi
RDSH - Henry M. Rosenstock, Keith Draxl, Bruce W. Steiner, and John T. Herron
Ionization energy determinations
IE (eV) | Method | Reference | Comment |
---|---|---|---|
7.87 ± 0.01 | EI | Rakita, Hoffman, et al., 1973 | LLK |
8.13 | CTS | Pitt, 1970 | RDSH |

References

Rakita, Hoffman, et al., 1973
Rakita, P.E.; Hoffman, M.K.; Andrews, M.N.; Bursey, M.M.,
σ-π Conjugation in group IVA compounds of indene and indane,
J. Organomet. Chem., 1973, 49, 213. [all data]
Pitt, 1970
Pitt, C.G.,
Hyperconjugation: An alternative to the concept of the pπ-dπ bond in Group IV chemistry,
J. Organomet. Chem., 1970, 23, 35. [all data]