Benzenamine, 2,3,4,5,6-pentafluoro-N,N-dimethyl-
- Formula: C8H6F5N
- Molecular weight: 211.1320
- IUPAC Standard InChIKey: KGTLSNJIWZULPZ-UHFFFAOYSA-N
- CAS Registry Number: 1801-14-5
- Chemical structure:
View 3d structure (requires JavaScript / HTML 5) - Permanent link for this species. Use this link for bookmarking this species for future reference.

Gas phase ion energetics data

Data compiled by: Sharon G. Lias, John E. Bartmess, Joel F. Liebman, John L. Holmes, Rhoda D. Levin, and W. Gary Mallard
Ionization energy determinations
IE (eV) | Method | Reference | Comment |
---|---|---|---|
8.48 | PE | Furin, Sultanov, et al., 1987 | Vertical value |

References

Furin, Sultanov, et al., 1987
Furin, G.G.; Sultanov, A.S.; Furlei, I.I.,
Photoelectronic spectra of fluorine-containing aromatic amines,
Dokl. Phys. Chem., 1987, 530. [all data]
(editor), 1980
(editor), Koptyug V.A.,
Atlas of Spectra of Aromatic and Heterocyclic Compaunds, 1980, 18, 24. [all data]