Tricyclo[3.2.1.13,6]nonan-7-one
- Formula: C9H12O
- Molecular weight: 136.1910
- IUPAC Standard InChIKey: QUXWGFTVVNVNFO-UHFFFAOYSA-N
- CAS Registry Number: 17931-67-8
- Chemical structure:
View 3d structure (requires JavaScript / HTML 5) - Other names: Tricyclo[3.2.1.13,6]nonan-7-one

Gas phase ion energetics data

Data compiled by: Sharon G. Lias, Rhoda D. Levin, and Sherif A. Kafafi
Ionization energy determinations
IE (eV) | Method | Reference | Comment |
---|---|---|---|
8.81 | PE | Kovac and Klasinc, 1978 | Vertical value |

References

Kovac and Klasinc, 1978
Kovac, B.; Klasinc, L.,
Photoelectron spectroscopy of adamantane and some adamantanones,
Croat. Chem. Acta, 1978, 51, 55. [all data]