Uranium, tetrakis(pentan-2,4-dionato)-
- Formula: C20H28O8U
- Molecular weight: 634.4604
- CAS Registry Number: 17923-26-1

Gas phase thermochemistry data

Data compiled by: José A. Martinho Simões
Quantity | Value | Units | Method | Reference | Comment |
---|---|---|---|---|---|
ΔfH°gas | -2071. ± 16. | kJ/mol | Review | Martinho Simões |

Condensed phase thermochemistry data

Data compiled by: José A. Martinho Simões
Quantity | Value | Units | Method | Reference | Comment |
---|---|---|---|---|---|
ΔfH°solid | -2219. ± 15. | kJ/mol | Review | Martinho Simões | |
Quantity | Value | Units | Method | Reference | Comment |
ΔcH°solid | -10844. ± 15. | kJ/mol | CC-SB | Tel'noi, Larina, et al., 1991 |

Phase change data

Data compiled by: José A. Martinho Simões
Quantity | Value | Units | Method | Reference | Comment |
---|---|---|---|---|---|
ΔsubH° | 148.1 ± 4.6 | kJ/mol | CC-SB | Tel'noi, Larina, et al., 1991 |

Gas phase ion energetics data

Data compiled as indicated in comments:
LBLHLM - Sharon G. Lias, John E. Bartmess, Joel F. Liebman, John L. Holmes, Rhoda D. Levin, and W. Gary Mallard
LLK - Sharon G. Lias, Rhoda D. Levin, and Sherif A. Kafafi
Ionization energy determinations
IE (eV) | Method | Reference | Comment |
---|---|---|---|
6.1 | PE | Casarin, Ciliberto, et al., 1982 | LBLHLM |
6.65 | PE | Casarin, Ciliberto, et al., 1982 | Vertical value; LBLHLM |
6.65 | PE | Fragala, Condorelli, et al., 1978 | Vertical value; LLK |

References

Martinho Simões
Martinho Simões, J.A.,
Private communication (see http://webbook.nist.gov/chemistry/om/). [all data]
Tel'noi, Larina, et al., 1991
Tel'noi, V.I.; Larina, V.N.; Kuznetsov, N.T.; Sevast'yanov, V.G.; Krasnodubskaya, S.V.; Filatov, I.Yu.,
Vysokochist. Veshchestva, 1991, 194.. [all data]
Casarin, Ciliberto, et al., 1982
Casarin, M.; Ciliberto, E.; Fragala, I.; Granozzi, G.,
Photoelectron spectroscopy of f-element coordination compounds. 2. He-II spectra of β-diketonate complexes of uranium(IV), thorium(IV), zirconium(IV) and dioxouranium(VI),
Inorg. Chim. Acta, 1982, 64, 247. [all data]
Fragala, Condorelli, et al., 1978
Fragala, I.; Condorelli, G.; Tondello, A.; Cassol, A.,
Photoelectron spectroscopy of f-element coordination compounds. 1. β-diketonate complexes of uranium(IV), thorium(IV), zirconium(IV), dioxouranium(VI),
Inorg. Chem., 1978, 17, 3175. [all data]