2,5-bis(Trimethylsilyl)thiophene
- Formula: C10H20SSi2
- Molecular weight: 228.502
- IUPAC Standard InChIKey: FPUOKUOVIWJMDC-UHFFFAOYSA-N
- CAS Registry Number: 17906-71-7
- Chemical structure:
View 3d structure (requires JavaScript / HTML 5) - Permanent link for this species. Use this link for bookmarking this species for future reference.

Gas phase ion energetics data

Data compiled as indicated in comments:
LBLHLM - Sharon G. Lias, John E. Bartmess, Joel F. Liebman, John L. Holmes, Rhoda D. Levin, and W. Gary Mallard
Ionization energy determinations
IE (eV) | Method | Reference | Comment |
---|---|---|---|
7.8 | PE | Veszpremi, Harada, et al., 1983 | LBLHLM |
8.20 | PE | Bock and Roth, 1983 | LBLHLM |
8.40 | PE | Veszpremi, Harada, et al., 1983 | Vertical value; LBLHLM |

References

Veszpremi, Harada, et al., 1983
Veszpremi, T.; Harada, Y.; Ohno, K.; Mutoh, H.,
Photoelectron and penning ionization electron spectroscopic investigation of trimethylsilyl- and t-butyl-thiophenes,
J. Organomet. Chem., 1983, 252, 121. [all data]
Bock and Roth, 1983
Bock, H.; Roth, B.,
Radical ions. 49. Redox reactions of some thiophene derivatives,
Phosphorus Sulfur, 1983, 14, 211. [all data]