Trisiloxane, 3-ethyl-1,1,1,3,5,5,5-heptamethyl-
- Formula: C9H26O2Si3
- Molecular weight: 250.5580
- IUPAC Standard InChIKey: HLPWCQDWRYCGLK-UHFFFAOYSA-N
- CAS Registry Number: 17861-60-8
- Chemical structure:
View 3d structure (requires JavaScript / HTML 5) - Permanent link for this species. Use this link for bookmarking this species for future reference.

Gas phase ion energetics data

Data compiled by: Sharon G. Lias, Rhoda D. Levin, and Sherif A. Kafafi
Appearance energy determinations
Ion | AE (eV) | Other Products | Method | Reference | Comment |
---|---|---|---|---|---|
C3H9SiO+ | 21.8 ± 0.2 | ? | EI | Borossay, Csakvari, et al., 1971 | |
C3H9Si+ | 15.3 ± 0.2 | ? | EI | Borossay, Csakvari, et al., 1971 |

References

Borossay, Csakvari, et al., 1971
Borossay, J.; Csakvari, B.; Szepes, L.,
Determination of bond energies of organic silicon compounds on the basis of appearance potentials,
Int. J. Mass Spectrom. Ion Phys., 1971, 7, 47. [all data]