4α,8α-(Methanothiomethano)naphthalene,1,2,3,4,5,8-hexahydro-
- Formula: C12H18S
- Molecular weight: 194.336
- IUPAC Standard InChIKey: LPZHLGIDTACMCQ-UHFFFAOYSA-N
- CAS Registry Number: 17853-64-4
- Chemical structure:
View 3d structure (requires JavaScript / HTML 5) - Permanent link for this species. Use this link for bookmarking this species for future reference.

Gas phase ion energetics data

Data compiled by: Sharon G. Lias, Rhoda D. Levin, and Sherif A. Kafafi
Ionization energy determinations
IE (eV) | Method | Reference | Comment |
---|---|---|---|
8.07 | PE | Bohm and Gleiter, 1979 | Vertical value |

References

Bohm and Gleiter, 1979
Bohm, M.C.; Gleiter, R.,
Electronic structure and reactivity of propellanes,
Tetrahedron, 1979, 35, 675. [all data]