Cyclooctyne
- Formula: C8H12
- Molecular weight: 108.1809
- IUPAC Standard InChIKey: ZPWOOKQUDFIEIX-UHFFFAOYSA-N
- CAS Registry Number: 1781-78-8
- Chemical structure:
View 3d structure (requires JavaScript / HTML 5) - Permanent link for this species. Use this link for bookmarking this species for future reference.

Reaction thermochemistry data

Data compiled by: Hussein Y. Afeefy, Joel F. Liebman, and Stephen E. Stein
Individual Reactions
By formula: 2H2 + C8H12 = C8H16
Quantity | Value | Units | Method | Reference | Comment |
---|---|---|---|---|---|
ΔrH° | -291. ± 0.8 | kJ/mol | Chyd | Roth, Hopf, et al., 1994 | liquid phase; solvent: Isooctane |
ΔrH° | -289. | kJ/mol | Chyd | Turner, Jarrett, et al., 1973 | liquid phase; solvent: Acetic acid |

Gas phase ion energetics data

Data compiled by: Sharon G. Lias, Rhoda D. Levin, and Sherif A. Kafafi
Ionization energy determinations
IE (eV) | Method | Reference | Comment |
---|---|---|---|
8.9 | PE | Bieri, Heilbronner, et al., 1974 | |
9.10 | PE | Schmidt, Schweig, et al., 1974 | Vertical value |

References

Roth, Hopf, et al., 1994
Roth, W.R.; Hopf, H.; Horn, C.,
Propargyl-Stabilisierungsenergie,
Chem. Ber., 1994, 127, 1781-1795. [all data]
Turner, Jarrett, et al., 1973
Turner, R.B.; Jarrett, A.D.; Goebel, P.; Mallon, B.J.,
Heats of hydrogenation. 9. Cyclic acetylenes and some miscellaneous olefins,
J. Am. Chem. Soc., 1973, 95, 790-792. [all data]
Bieri, Heilbronner, et al., 1974
Bieri, G.; Heilbronner, E.; Kloster-Jensen, E.; Schmelzer, A.; Wirz, J.,
Electronic states of 1,5-cyclooctadiyne radical cation and of related systems: the electronic structure of cis-bent carbon-carbon triple bonds,
Helv. Chim. Acta, 1974, 57, 1265. [all data]
Schmidt, Schweig, et al., 1974
Schmidt, H.; Schweig, A.; Krebs, A.,
Splitting of the degenerate acetylenic πMOs; a probe for ring strain,
Tetrahedron Lett., 1974, 16, 1471. [all data]