1,3,6-Trioxocane
- Formula: C5H10O3
- Molecular weight: 118.1311
- IUPAC Standard InChIKey: AUAGGMPIKOZAJZ-UHFFFAOYSA-N
- CAS Registry Number: 1779-19-7
- Chemical structure:
View 3d structure (requires JavaScript / HTML 5) - Other names: Diethylene glycol formal; Diglycol formal; 1,3,6-Trioxacyclooctane; 1,3,6-Trioxocin, tetrahydro-; l,3,6-Trioxocane

Gas phase thermochemistry data

Data compiled as indicated in comments:
ALS - Hussein Y. Afeefy, Joel F. Liebman, and Stephen E. Stein
GT - Glushko Thermocenter, Russian Academy of Sciences, Moscow
Quantity | Value | Units | Method | Reference | Comment |
---|---|---|---|---|---|
ΔfH°gas | -467.2 ± 1.2 | kJ/mol | Ccr | Bystrm and Mansson, 1982 | ALS |
Constant pressure heat capacity of gas
Cp,gas (J/mol*K) | Temperature (K) | Reference | Comment |
---|---|---|---|
37.55 | 50. | Dorofeeva O.V., 1992 | p=1 bar.; GT |
52.34 | 100. | ||
69.59 | 150. | ||
88.11 | 200. | ||
118.87 | 273.15 | ||
130.0 ± 4.5 | 298.15 | ||
130.83 | 300. | ||
174.32 | 400. | ||
211.93 | 500. | ||
242.76 | 600. | ||
268.07 | 700. | ||
289.11 | 800. | ||
306.80 | 900. | ||
321.78 | 1000. | ||
334.55 | 1100. | ||
345.46 | 1200. | ||
354.83 | 1300. | ||
362.89 | 1400. | ||
369.86 | 1500. |

Condensed phase thermochemistry data

Data compiled by: Hussein Y. Afeefy, Joel F. Liebman, and Stephen E. Stein
Quantity | Value | Units | Method | Reference | Comment |
---|---|---|---|---|---|
ΔfH°liquid | -516.0 ± 1.2 | kJ/mol | Ccr | Bystrm and Mansson, 1982 | |
Quantity | Value | Units | Method | Reference | Comment |
ΔcH°liquid | -2880.75 ± 0.99 | kJ/mol | Ccr | Bystrm and Mansson, 1982 | Corresponding ΔfHºliquid = -515.95 kJ/mol (simple calculation by NIST; no Washburn corrections) |

Phase change data

Data compiled as indicated in comments:
ALS - Hussein Y. Afeefy, Joel F. Liebman, and Stephen E. Stein
DRB - Donald R. Burgess, Jr.
AC - William E. Acree, Jr., James S. Chickos
Quantity | Value | Units | Method | Reference | Comment |
---|---|---|---|---|---|
ΔvapH° | 48.77 | kJ/mol | N/A | Majer and Svoboda, 1985 | |
ΔvapH° | 48.77 ± 0.21 | kJ/mol | C | Bystrm and Mansson, 1982 | ALS |
ΔvapH° | 48.8 | kJ/mol | N/A | Bystrm and Mansson, 1982 | DRB |
ΔvapH° | 48.8 ± 0.2 | kJ/mol | C | Bystr«65533»m and M«65533»nsson, 1982 | AC |

Reaction thermochemistry data

Data compiled by: Hussein Y. Afeefy, Joel F. Liebman, and Stephen E. Stein
Individual Reactions
By formula: C10H20O6 = 2C5H10O3
Quantity | Value | Units | Method | Reference | Comment |
---|---|---|---|---|---|
ΔrH° | 29. ± 1.5 | kJ/mol | Eqk | Yamashita, Mayumi, et al., 1980 | liquid phase; solvent: CH2Cl2 |

Gas phase ion energetics data

Data compiled by: Henry M. Rosenstock, Keith Draxl, Bruce W. Steiner, and John T. Herron
Ionization energy determinations
IE (eV) | Method | Reference |
---|---|---|
9.23 | EI | Collin and Conde, 1966 |
Appearance energy determinations
Ion | AE (eV) | Other Products | Method | Reference | Comment |
---|---|---|---|---|---|
C2H3O+ | 13.16 | ? | EI | Collin and Conde, 1966 | |
C2H4O+ | 10.03 | ? | EI | Collin and Conde, 1966 | |
C3H6O+ | 11.4 | ? | EI | Collin and Conde, 1966 | |
C4H8O2+ | 9.92 | CH2O | EI | Collin and Conde, 1966 |

References

Bystrm and Mansson, 1982
Bystrm, K.; Mansson, M.,
Enthalpies of formation of some cyclic 1,3- and 1,4-Di- and poly-ethers: Thermochemical strain in the -O-C-O and -O-C-C-O- groups,
J. Chem. Soc. Perkin Trans. 2, 1982, 565. [all data]
Dorofeeva O.V., 1992
Dorofeeva O.V.,
Ideal gas thermodynamic properties of oxygen heterocyclic compounds. Part 2. Six-membered, seven-membered and eight-membered rings,
Thermochim. Acta, 1992, 200, 121-150. [all data]
Majer and Svoboda, 1985
Majer, V.; Svoboda, V.,
Enthalpies of Vaporization of Organic Compounds: A Critical Review and Data Compilation, Blackwell Scientific Publications, Oxford, 1985, 300. [all data]
Bystr«65533»m and M«65533»nsson, 1982
Bystr«65533»m, Katarina; M«65533»nsson, Margret,
Enthalpies of formation of some cyclic 1,3- and 1,4-di- and poly-ethers: thermochemical strain in the ?O?C?O? and ?O?C?C?O? groups,
J. Chem. Soc., Perkin Trans. 2, 1982, 5, 565, https://doi.org/10.1039/p29820000565
. [all data]
Yamashita, Mayumi, et al., 1980
Yamashita, Y.; Mayumi, J.; Kawakami, Y.; Ito, K.,
Ring-chain equilibrium of macrocyclic formals,
Macromolecules, 1980, 13, 1075-1080. [all data]
Collin and Conde, 1966
Collin, J.E.; Conde, G.,
L'ionisation et la dissociation des polyethers cycliques soumis a l'impact electronique,
Bull. Classe Sci. Acad. Roy. Belg., 1966, 52, 978. [all data]