3,7-Benzofurandiol, 2,3-dihydro-2,2-dimethyl-
- Formula: C10H12O3
- Molecular weight: 180.2005
- IUPAC Standard InChIKey: CNFFSKAZCVPTPA-UHFFFAOYSA-N
- CAS Registry Number: 17781-15-6
- Chemical structure:
View 3d structure (requires JavaScript / HTML 5) - Other names: 3-Hydroxycarbofuran phenol; Carbofuran-3-hydroxy-7-phenol; Carbofuran 7-phenol 3-oh; 2,2-Dimethyl-2,3-dihydro-1-benzofuran-3,7-diol; 2,2-Dimethyl-3,7-dihydroxy-2,3-dihydrobenzofuran; 3-Hydroxycarbofuran-7-ol

Phase change data

Data compiled by: Thermodynamics Research Center, NIST Boulder Laboratories, Chris Muzny director
Quantity | Value | Units | Method | Reference | Comment |
---|---|---|---|---|---|
Tfus | 383.94 | K | N/A | Donnelly, Drewes, et al., 1990 | Uncertainty assigned by TRC = 0.2 K |

References

Donnelly, Drewes, et al., 1990
Donnelly, J.R.; Drewes, L.A.; Johnson, R.L.; Munslow, W.D.; Knapp, K.K.; Sovocool, G.W.,
Purity and heat of fusion data for environmental standards as determined by differential scanning calorimetry,
Thermochim. Acta, 1990, 167, 2, 155, https://doi.org/10.1016/0040-6031(90)80476-F
. [all data]