Benzenepentanamine
- Formula: C11H17N
- Molecular weight: 163.2594
- IUPAC Standard InChIKey: CGNLNKFBSBFJHY-UHFFFAOYSA-N
- CAS Registry Number: 17734-21-3
- Chemical structure:
View 3d structure (requires JavaScript / HTML 5) - Permanent link for this species. Use this link for bookmarking this species for future reference.

Gas phase ion energetics data

Data compiled by: Sharon G. Lias, Rhoda D. Levin, and Sherif A. Kafafi
Appearance energy determinations
Ion | AE (eV) | Other Products | Method | Reference | Comment |
---|---|---|---|---|---|
C11H14+ | 9.4 ± 0.1 | NH3 | EI | Schwarz, Wesdemiotis, et al., 1975 |

References

Schwarz, Wesdemiotis, et al., 1975
Schwarz, H.; Wesdemiotis, C.; Hess, B.; Levsen, K.,
Massenspektrometrische Untersuchung organischer Stickstoffverbindungen,
Org. Mass Spectrom., 1975, 10, 595. [all data]