Decaborane(14)
- Formula: B10H14
- Molecular weight: 122.221
- IUPAC Standard InChIKey: XAMMYYSPUSIWAS-UHFFFAOYSA-N
- CAS Registry Number: 17702-41-9
- Chemical structure:

Condensed phase thermochemistry data

Quantity | Value | Units | Method | Reference | Comment |
---|---|---|---|---|---|
ΔfH°liquid | -1.70 | kcal/mol | Review | Chase, 1998 | Data last reviewed in December, 1964 |
Quantity | Value | Units | Method | Reference | Comment |
S°liquid,1 bar | 56.056 | cal/mol*K | Review | Chase, 1998 | Data last reviewed in December, 1964 |
Quantity | Value | Units | Method | Reference | Comment |
ΔfH°solid | -6.900 | kcal/mol | Review | Chase, 1998 | Data last reviewed in December, 1964 |
Quantity | Value | Units | Method | Reference | Comment |
S°solid | 42.201 | cal/mol*K | Review | Chase, 1998 | Data last reviewed in December, 1964 |
Liquid Phase Heat Capacity (Shomate Equation)
Cp° = A + B*t + C*t2 + D*t3 +
E/t2
H° − H°298.15= A*t + B*t2/2 +
C*t3/3 + D*t4/4 − E/t + F − H
S° = A*ln(t) + B*t + C*t2/2 + D*t3/3 −
E/(2*t2) + G
Cp = heat capacity (cal/mol*K)
H° = standard enthalpy (kcal/mol)
S° = standard entropy (cal/mol*K)
t = temperature (K) / 1000.
View plot Requires a JavaScript / HTML 5 canvas capable browser.
Temperature (K) | 371.93 to 500. | 500. to 1500. |
---|---|---|
A | 211.4000 | 42.68219 |
B | -1736.480 | 114.3660 |
C | 5705.129 | -30.53659 |
D | -5484.149 | -4.310651 |
E | -0.230900 | -2.179920 |
F | -27.93939 | -25.68819 |
G | 623.1931 | 65.08860 |
H | -1.704831 | -1.704831 |
Reference | Chase, 1998 | Chase, 1998 |
Comment | Data last reviewed in December, 1964 | Data last reviewed in December, 1964 |
Solid Phase Heat Capacity (Shomate Equation)
Cp° = A + B*t + C*t2 + D*t3 +
E/t2
H° − H°298.15= A*t + B*t2/2 +
C*t3/3 + D*t4/4 − E/t + F − H
S° = A*ln(t) + B*t + C*t2/2 + D*t3/3 −
E/(2*t2) + G
Cp = heat capacity (cal/mol*K)
H° = standard enthalpy (kcal/mol)
S° = standard entropy (cal/mol*K)
t = temperature (K) / 1000.
View plot Requires a JavaScript / HTML 5 canvas capable browser.
Temperature (K) | 298. to 371.93 |
---|---|
A | 865.2151 |
B | -4656.931 |
C | 9861.879 |
D | -6783.246 |
E | -10.80394 |
F | -167.8394 |
G | 2038.542 |
H | -6.900000 |
Reference | Chase, 1998 |
Comment | Data last reviewed in December, 1964 |

Gas phase ion energetics data

Data compiled as indicated in comments:
LLK - Sharon G. Lias, Rhoda D. Levin, and Sherif A. Kafafi
RDSH - Henry M. Rosenstock, Keith Draxl, Bruce W. Steiner, and John T. Herron
Ionization energy determinations
IE (eV) | Method | Reference | Comment |
---|---|---|---|
9.88 ± 0.03 | PE | Lloyd, Lynaugh, et al., 1975 | LLK |
10.3 ± 0.5 | EI | Kaufman, Koski, et al., 1962 | RDSH |
11.0 ± 0.5 | EI | Margrave, 1960 | RDSH |
10.15 | PE | Roberts, 1974 | Vertical value; LLK |
Appearance energy determinations
Ion | AE (eV) | Other Products | Method | Reference | Comment |
---|---|---|---|---|---|
Bl0H7+ | 12.5 ± 0.5 | 3H2+H | EI | Kaufman, Koski, et al., 1962 | RDSH |
B10H6+ | 13.1 ± 0.3 | 4H2 | EI | Kaufman, Koski, et al., 1962 | RDSH |
B10H8+ | 12.7 ± 0.3 | 3H2 | EI | Kaufman, Koski, et al., 1962 | RDSH |
B10H10+ | 11.6 ± 0.2 | 2H2 | EI | Kaufman, Koski, et al., 1962 | RDSH |
B10H11+ | 10.8 ± 0.5 | H2+H | EI | Kaufman, Koski, et al., 1962 | RDSH |
B10H12+ | 10.9 ± 0.2 | H2 | EI | Kaufman, Koski, et al., 1962 | RDSH |

References

Chase, 1998
Chase, M.W., Jr.,
NIST-JANAF Themochemical Tables, Fourth Edition,
J. Phys. Chem. Ref. Data, Monograph 9, 1998, 1-1951. [all data]
Lloyd, Lynaugh, et al., 1975
Lloyd, D.R.; Lynaugh, N.; Roberts, P.J.; Guest, M.F.,
Photoelectron studies of boron and compounds, Part 5. -Higher boron hydrides B4H10, B5H9, B10H14,
J. Chem. Soc. Faraday Trans. 2, 1975, 71, 1382. [all data]
Kaufman, Koski, et al., 1962
Kaufman, J.J.; Koski, W.S.; Kuhns, L.J.; Law, R.W.,
Appearance and ionization potentials of selected fragments from decaborane, 11B10H14,
J. Am. Chem. Soc., 1962, 84, 4198. [all data]
Margrave, 1960
Margrave, J.L.,
Ionization potentials of B5H9, B5H8I, B10H14, and B10H13C2H5 from electron impact studies,
J. Chem. Phys., 1960, 32, 1889. [all data]
Roberts, 1974
Roberts, P.,
Title unavailable, Thesis, University of Birmingham, 1974. [all data]