Acetamide, N-(2,6-dichlorophenyl)-
- Formula: C8H7Cl2NO
- Molecular weight: 204.053
- IUPAC Standard InChIKey: DWVWVSLAIJHBBG-UHFFFAOYSA-N
- CAS Registry Number: 17700-54-8
- Chemical structure:
View 3d structure (requires JavaScript / HTML 5) - Other names: Acetanilide, 2',6'-dichloro-; 2,6-Dichloroacetanilide; 2',6'-Dichloroacetanilide; N-(2,6-dichlorophenyl)acetamide

Gas phase ion energetics data

Data compiled by: Sharon G. Lias, Rhoda D. Levin, and Sherif A. Kafafi
Ionization energy determinations
IE (eV) | Method | Reference |
---|---|---|
8.25 ± 0.03 | EI | Benezra and Bursey, 1972 |
Appearance energy determinations
Ion | AE (eV) | Other Products | Method | Reference | Comment |
---|---|---|---|---|---|
C2H3O+ | 13.40 ± 0.03 | ? | EI | Benezra and Bursey, 1972 | |
C6H5NCl2+ | 9.93 ± 0.03 | CH2=C=O | EI | Benezra and Bursey, 1972 | |
C8H7NOCl+ | 8.79 ± 0.03 | ? | EI | Benezra and Bursey, 1972 |

References

Benezra and Bursey, 1972
Benezra, S.A.; Bursey, M.M.,
ortho-Effects in mass spectra. Alteration of the molecular-ion energy distribution in disubstituted acetanilides,
Z. Naturforsch. A:, 1972, 27, 670. [all data]