1-Octen-3-yne
- Formula: C8H12
- Molecular weight: 108.1809
- IUPAC Standard InChIKey: UEKPKVCWUZMBML-UHFFFAOYSA-N
- CAS Registry Number: 17679-92-4
- Chemical structure:
View 3d structure (requires JavaScript / HTML 5) - Other names: n-C4H9C≡CCH=CH2; 1-Octene-3-yne

Phase change data

Data compiled by: Thermodynamics Research Center, NIST Boulder Laboratories, Chris Muzny director
Quantity | Value | Units | Method | Reference | Comment |
---|---|---|---|---|---|
Tboil | 407. | K | N/A | Petrov, Kolesova, et al., 1957 | Uncertainty assigned by TRC = 3. K |

Reaction thermochemistry data

Data compiled by: Hussein Y. Afeefy, Joel F. Liebman, and Stephen E. Stein
Individual Reactions
By formula: 3H2 + C8H12 = C8H18
Quantity | Value | Units | Method | Reference | Comment |
---|---|---|---|---|---|
ΔrH° | -391. ± 6.3 | kJ/mol | Chyd | Flitcroft and Skinner, 1958 | liquid phase |

Gas phase ion energetics data

Data compiled as indicated in comments:
LLK - Sharon G. Lias, Rhoda D. Levin, and Sherif A. Kafafi
Ionization energy determinations
IE (eV) | Method | Reference | Comment |
---|---|---|---|
8.83 ± 0.01 | PE | Carlier, Mouvier, et al., 1979 | LLK |

References

Petrov, Kolesova, et al., 1957
Petrov, A.A.; Kolesova, V.A.; Porfir'eva, Y.I.,
Conjugated Systems. LXXVIII Raman Spectra and Reactivity of Vinylacetylenic Hydrocarbons,
Zh. Obshch. Khim., 1957, 27, 2081-7. [all data]
Flitcroft and Skinner, 1958
Flitcroft, T.L.; Skinner, H.A.,
Heats of hydrogenation Part 2.-Acetylene derivatives,
Trans. Faraday Soc., 1958, 54, 47-53. [all data]
Carlier, Mouvier, et al., 1979
Carlier, P.; Mouvier, G.; Mesnard, D.; Miginiac, L.,
Etude par spectrometrie de photoelectrons de la structure electronique des phenyl-alcynes conjugues,
J. Electron Spectrosc. Relat. Phenom., 1979, 16, 147. [all data]