2-Methyl-1-hepten-3-yne
- Formula: C8H12
- Molecular weight: 108.1809
- IUPAC Standard InChIKey: UOOFRLPCQNNECP-UHFFFAOYSA-N
- CAS Registry Number: 17669-40-8
- Chemical structure:
View 3d structure (requires JavaScript / HTML 5) - Other names: n-C3H7C≡CC(CH3)=CH2; 1-Hepten-3-yne, 2-methyl-; 2-Methyl-hept-1-en-3-yne; 2-Methyl-1-heptene-3-yne

Gas phase ion energetics data

Data compiled as indicated in comments:
LLK - Sharon G. Lias, Rhoda D. Levin, and Sherif A. Kafafi
Ionization energy determinations
IE (eV) | Method | Reference | Comment |
---|---|---|---|
8.62 ± 0.01 | PE | Carlier, Mouvier, et al., 1979 | LLK |

References

Carlier, Mouvier, et al., 1979
Carlier, P.; Mouvier, G.; Mesnard, D.; Miginiac, L.,
Etude par spectrometrie de photoelectrons de la structure electronique des phenyl-alcynes conjugues,
J. Electron Spectrosc. Relat. Phenom., 1979, 16, 147. [all data]