Ethan-d5-amine
- Formula: C2H2D5N
- Molecular weight: 50.1145
- IUPAC Standard InChIKey: QUSNBJAOOMFDIB-ZBJDZAJPSA-N
- CAS Registry Number: 17616-24-9
- Chemical structure:
View 3d structure (requires JavaScript / HTML 5) - Isotopologues:

Gas phase ion energetics data

Data compiled by: Henry M. Rosenstock, Keith Draxl, Bruce W. Steiner, and John T. Herron
Ionization energy determinations
IE (eV) | Method | Reference |
---|---|---|
9.37 | EI | Collin, Franskin, et al., 1967 |
Appearance energy determinations
Ion | AE (eV) | Other Products | Method | Reference | Comment |
---|---|---|---|---|---|
CHDN+ | 14.9 | ? | EI | Collin, Franskin, et al., 1967 | |
CH2DN+ | 12.87 | CD4 | EI | Collin, Franskin, et al., 1967 | |
CH2D2N+ | 10.13 | CD3 | EI | Collin, Franskin, et al., 1967 | |
CH2N+ | 15.1 | ? | EI | Collin, Franskin, et al., 1967 | |
C2D5+ | 13.4 | ? | EI | Collin, Franskin, et al., 1967 | |
C2HD5N+ | 17.30 | H | EI | Collin, Franskin, et al., 1967 | |
C2H2D4N+ | 11.90 ± 0.20 | D | El | Collin, Franskin, et al., 1967 |

References

Collin, Franskin, et al., 1967
Collin, J.E.; Franskin, M.J.; Hyatt, D.,
Etude par spectrometrie de masse des mechanismes de dissociation dans l'ethylamine et ses homologues deuteres,
Bull. Soc. Roy. Sci. Liege, 1967, 36, 318. [all data]