Cyclopropanecarboxylic acid
- Formula: C4H6O2
- Molecular weight: 86.0892
- IUPAC Standard InChIKey: YMGUBTXCNDTFJI-UHFFFAOYSA-N
- CAS Registry Number: 1759-53-1
- Chemical structure:
View 3d structure (requires JavaScript / HTML 5) - Other names: Carboxycyclopropane; Cyclopropionic acid; Cyclopropylcarboxylic acid; Cyclopropylmethanoic acid; Cyclpropanecarboxylic acid

Gas phase thermochemistry data

Data compiled by: Glushko Thermocenter, Russian Academy of Sciences, Moscow
Constant pressure heat capacity of gas
Cp,gas (cal/mol*K) | Temperature (K) | Reference | Comment |
---|---|---|---|
22.65 | 298.16 | Tabacik V., 1978 | |
26.429 | 353.16 | ||
29.661 | 403.16 | ||
32.591 | 453.16 |

Condensed phase thermochemistry data

Data compiled by: Hussein Y. Afeefy, Joel F. Liebman, and Stephen E. Stein
Quantity | Value | Units | Method | Reference | Comment |
---|---|---|---|---|---|
ΔcH°liquid | -486.4 | kcal/mol | Ccb | Bruylants and Stassens, 1921 | Corresponding ΔfHºliquid = -94.7 kcal/mol (simple calculation by NIST; no Washburn corrections) |
ΔcH°liquid | -479.7 | kcal/mol | Ccb | Roth and Ostling, 1913 | Corresponding ΔfHºliquid = -101.4 kcal/mol (simple calculation by NIST; no Washburn corrections) |

Phase change data

Data compiled as indicated in comments:
BS - Robert L. Brown and Stephen E. Stein
AC - William E. Acree, Jr., James S. Chickos
Quantity | Value | Units | Method | Reference | Comment |
---|---|---|---|---|---|
Tboil | 456.2 | K | N/A | Weast and Grasselli, 1989 | BS |
Tboil | 455. to 457. | K | N/A | Frinton Laboratories Inc., 1986 | BS |
Enthalpy of vaporization
ΔvapH (kcal/mol) | Temperature (K) | Method | Reference | Comment |
---|---|---|---|---|
14.1 ± 0.07 | 340. | EB | Steele, Chirico, et al., 2002 | Based on data from 357. to 473. K.; AC |
13.3 ± 0.05 | 380. | EB | Steele, Chirico, et al., 2002 | Based on data from 357. to 473. K.; AC |
12.5 ± 0.05 | 420. | EB | Steele, Chirico, et al., 2002 | Based on data from 357. to 473. K.; AC |
11.7 ± 0.1 | 460. | EB | Steele, Chirico, et al., 2002 | Based on data from 357. to 473. K.; AC |

Reaction thermochemistry data

Data compiled by: John E. Bartmess
Individual Reactions
C4H5O2- + =
By formula: C4H5O2- + H+ = C4H6O2
Quantity | Value | Units | Method | Reference | Comment |
---|---|---|---|---|---|
ΔrH° | 346.0 ± 2.2 | kcal/mol | G+TS | Caldwell, Renneboog, et al., 1989 | gas phase |
Quantity | Value | Units | Method | Reference | Comment |
ΔrG° | 339.0 ± 2.0 | kcal/mol | IMRE | Caldwell, Renneboog, et al., 1989 | gas phase |

Gas phase ion energetics data

Data evaluated as indicated in comments:
HL - Edward P. Hunter and Sharon G. Lias
Data compiled as indicated in comments:
B - John E. Bartmess
LLK - Sharon G. Lias, Rhoda D. Levin, and Sherif A. Kafafi
Quantity | Value | Units | Method | Reference | Comment |
---|---|---|---|---|---|
Proton affinity (review) | 196.3 | kcal/mol | N/A | Hunter and Lias, 1998 | HL |
Quantity | Value | Units | Method | Reference | Comment |
Gas basicity | 188.9 | kcal/mol | N/A | Hunter and Lias, 1998 | HL |
Ionization energy determinations
IE (eV) | Method | Reference | Comment |
---|---|---|---|
10.64 | PE | Holmes, Terlouw, et al., 1979 | LLK |
De-protonation reactions
C4H5O2- + =
By formula: C4H5O2- + H+ = C4H6O2
Quantity | Value | Units | Method | Reference | Comment |
---|---|---|---|---|---|
ΔrH° | 346.0 ± 2.2 | kcal/mol | G+TS | Caldwell, Renneboog, et al., 1989 | gas phase; B |
Quantity | Value | Units | Method | Reference | Comment |
ΔrG° | 339.0 ± 2.0 | kcal/mol | IMRE | Caldwell, Renneboog, et al., 1989 | gas phase; B |

References

Tabacik V., 1978
Tabacik V.,
Vibrational spectra in cyclopropane series. III. Fundamental modes of cyclopropanecarboxylic acid monomer and of its -OD species,
Spectrochim. Acta, 1978, A34, 315-329. [all data]
Bruylants and Stassens, 1921
Bruylants, P.; Stassens, A.,
Contribution a letude des composes a noyau trimethylenique,
Bull. Cl. Sci. Acad. R. Belg., 1921, 7, 702-719. [all data]
Roth and Ostling, 1913
Roth, W.A.; Ostling, G.J.,
Thermochemische Untersuchungen in der alicyclischen Reihe,
Ber., 1913, 46, 309-327. [all data]
Weast and Grasselli, 1989
CRC Handbook of Data on Organic Compounds, 2nd Editon, Weast,R.C and Grasselli, J.G., ed(s)., CRC Press, Inc., Boca Raton, FL, 1989, 1. [all data]
Frinton Laboratories Inc., 1986
Frinton Laboratories Inc.,
Catalog Number 11, Frinton Laboratories Inc., Vineland, NJ, 1986, 99. [all data]
Steele, Chirico, et al., 2002
Steele, W.V.; Chirico, R.D.; Knipmeyer, S.E.; Nguyen, A.,
Measurements of Vapor Pressure, Heat Capacity, and Density along the Saturation Line for Cyclopropane Carboxylic Acid, N , N -Diethylethanolamine, 2,3-Dihydrofuran, 5-Hexen-2-one, Perfluorobutanoic Acid, and 2-Phenylpropionaldehyde,
J. Chem. Eng. Data, 2002, 47, 4, 715-724, https://doi.org/10.1021/je010087j
. [all data]
Caldwell, Renneboog, et al., 1989
Caldwell, G.; Renneboog, R.; Kebarle, P.,
Gas Phase Acidities of Aliphatic Carboxylic Acids, Based on Measurements of Proton Transfer Equilibria,
Can. J. Chem., 1989, 67, 4, 661, https://doi.org/10.1139/v89-092
. [all data]
Hunter and Lias, 1998
Hunter, E.P.; Lias, S.G.,
Evaluated Gas Phase Basicities and Proton Affinities of Molecules: An Update,
J. Phys. Chem. Ref. Data, 1998, 27, 3, 413-656, https://doi.org/10.1063/1.556018
. [all data]
Holmes, Terlouw, et al., 1979
Holmes, J.L.; Terlouw, J.K.; Vijfhuizen, P.C.; A'Campo, C.,
Metastable ion studies XII-Molecular and fragment ion structures for isomeric C4H6O2 acids,
Org. Mass Spectrom., 1979, 14, 204. [all data]