Thiophene, 3-methoxy-
- Formula: C5H6OS
- Molecular weight: 114.166
- IUPAC Standard InChIKey: RFSKGCVUDQRZSD-UHFFFAOYSA-N
- CAS Registry Number: 17573-92-1
- Chemical structure:
View 3d structure (requires JavaScript / HTML 5) - Permanent link for this species. Use this link for bookmarking this species for future reference.

Gas phase ion energetics data

Data compiled by: Sharon G. Lias, John E. Bartmess, Joel F. Liebman, John L. Holmes, Rhoda D. Levin, and W. Gary Mallard
Ionization energy determinations
IE (eV) | Method | Reference | Comment |
---|---|---|---|
8.19 | PE | Bajic, Humski, et al., 1985 | |
8.37 | PE | Bajic, Humski, et al., 1985 | Vertical value |

References

Bajic, Humski, et al., 1985
Bajic, M.; Humski, K.; Klasinc, L.; Ruscic, B.,
Substitution effects on electronic structure of thiophene,
Z. Naturforsch. B:, 1985, 40, 1214. [all data]