Silane,[1,4-phenylenebis(methylene)]bis[trimethyl
- Formula: C14H26Si2
- Molecular weight: 250.5272
- IUPAC Standard InChIKey: IYXXYCYJDDVART-UHFFFAOYSA-N
- CAS Registry Number: 17557-09-4
- Chemical structure:
View 3d structure (requires JavaScript / HTML 5) - Permanent link for this species. Use this link for bookmarking this species for future reference.

Gas phase ion energetics data

Data compiled as indicated in comments:
LLK - Sharon G. Lias, Rhoda D. Levin, and Sherif A. Kafafi
RDSH - Henry M. Rosenstock, Keith Draxl, Bruce W. Steiner, and John T. Herron
Ionization energy determinations
IE (eV) | Method | Reference | Comment |
---|---|---|---|
7.25 | EI | Bock and Alt, 1970 | RDSH |
7.75 | PE | Bock, Kaim, et al., 1978 | Vertical value; LLK |
7.75 | PE | Bock and Kaim, 1978 | Vertical value; LLK |
7.75 | PE | Bock, Kaim, et al., 1977 | Vertical value; LLK |

References

Bock and Alt, 1970
Bock, H.; Alt, H.,
d-Orbital effects in silicon substituted π-electron systems. XXIV. Charge-transfer studies of silyl- and alkylbenzenes,
J. Am. Chem. Soc., 1970, 92, 1569. [all data]
Bock, Kaim, et al., 1978
Bock, H.; Kaim, W.; Rohwer, H.E.,
Die hyperkonjugative Stabilisierung von p-Xylol-Radikalkationen durch (H3C)3Si-Substituenten,
Chem. Ber., 1978, 111, 3573. [all data]
Bock and Kaim, 1978
Bock, H.; Kaim, W.,
Einelektronen-Oxidationen (H3C)3SiCH2-substituierter Benzole in der Gasphase und in Losung,
Chem. Ber., 1978, 111, 3552. [all data]
Bock, Kaim, et al., 1977
Bock, H.; Kaim, W.; Rohwer, H.E.,
Radical ions XI*. One-electron oxidation of alkylsilyl benzenes in the gas phase and in solution,
J. Organomet. Chem., 1977, 135, 14. [all data]