Acetophenone-α,α,α-d3
- Formula: C8H5D3O
- Molecular weight: 123.1670
- IUPAC Standard InChIKey: KWOLFJPFCHCOCG-FIBGUPNXSA-N
- CAS Registry Number: 17537-31-4
- Chemical structure:
View 3d structure (requires JavaScript / HTML 5) - Isotopologues:

Gas phase ion energetics data

Data compiled by: Henry M. Rosenstock, Keith Draxl, Bruce W. Steiner, and John T. Herron
Appearance energy determinations
Ion | AE (eV) | Other Products | Method | Reference | Comment |
---|---|---|---|---|---|
C7H5O+ | 10.45 | CD3 | EI | Majer and Patrick, 1963 |

References

Majer and Patrick, 1963
Majer, J.R.; Patrick, C.R.,
Appearance potentials of the benzoyl radical-ion,
J. Chem. Soc. Faraday Trans., 1963, 59, 1274. [all data]