3-Chloro-5,5-dimethylcyclohex-2-enone
- Formula: C8H11ClO
- Molecular weight: 158.625
- IUPAC Standard InChIKey: PJYTYJGMJDIKEJ-UHFFFAOYSA-N
- CAS Registry Number: 17530-69-7
- Chemical structure:
View 3d structure (requires JavaScript / HTML 5) - Other names: 3-Chloro-5,5-dimethyl-2-cyclohexen-1-one; 5,5-Dimethyl-3-chloro-2-cyclohexen-1-one; 3-Chloro-5,5-dimethyl-2-cyclohexenone; 5,5-Dimethyl-3-chlorocyclohex-2-enone

Gas phase ion energetics data

Data evaluated as indicated in comments:
HL - Edward P. Hunter and Sharon G. Lias
Data compiled as indicated in comments:
LBLHLM - Sharon G. Lias, John E. Bartmess, Joel F. Liebman, John L. Holmes, Rhoda D. Levin, and W. Gary Mallard
Quantity | Value | Units | Method | Reference | Comment |
---|---|---|---|---|---|
Proton affinity (review) | 867.9 | kJ/mol | N/A | Hunter and Lias, 1998 | HL |
Quantity | Value | Units | Method | Reference | Comment |
Gas basicity | 836.0 | kJ/mol | N/A | Hunter and Lias, 1998 | HL |
Ionization energy determinations
IE (eV) | Method | Reference | Comment |
---|---|---|---|
9.35 | PE | Pfister-Guillouzo, Geribaldi, et al., 1982 | Vertical value; LBLHLM |

References

Hunter and Lias, 1998
Hunter, E.P.; Lias, S.G.,
Evaluated Gas Phase Basicities and Proton Affinities of Molecules: An Update,
J. Phys. Chem. Ref. Data, 1998, 27, 3, 413-656, https://doi.org/10.1063/1.556018
. [all data]
Pfister-Guillouzo, Geribaldi, et al., 1982
Pfister-Guillouzo, G.; Geribaldi, S.; Gal, J.-F.,
Spectres photoelectroniques de cyclohexene-2-ones-1 diversement substituees en position 3. Correlations avec la reactivite,
Can. J. Chem., 1982, 60, 1163. [all data]