1,3-Dithiane-2-thione
- Formula: C4H6S3
- Molecular weight: 150.285
- IUPAC Standard InChIKey: BVNLWJVULAZODX-UHFFFAOYSA-N
- CAS Registry Number: 1748-15-8
- Chemical structure:
View 3d structure (requires JavaScript / HTML 5) - Other names: 1,3-Dithian-2-thione; m-Dithiane-2-thione; Carbonic acid, trithio-, cyclic trimethylene ester; Trimethylene trithiocarbonate; 1,3-Dithiacyclohexane-2-thione; 1,3-Propanedithiol, cyclic carbonotrithioate; 1,3-Propanedithiol, cyclic trithioacrbonate

Gas phase thermochemistry data

Data compiled by: Hussein Y. Afeefy, Joel F. Liebman, and Stephen E. Stein
Quantity | Value | Units | Method | Reference | Comment |
---|---|---|---|---|---|
ΔfH°gas | 77.5 ± 2.7 | kJ/mol | Ccr | Geiseler, Schaffernicht, et al., 1967 | Reanalyzed by Cox and Pilcher, 1970, Original value = 78.07 kJ/mol |
Quantity | Value | Units | Method | Reference | Comment |
ΔcH°gas | -4224.6 ± 0.4 | kJ/mol | Ccr | Geiseler, Schaffernicht, et al., 1967 |

Phase change data

Data compiled as indicated in comments:
ALS - Hussein Y. Afeefy, Joel F. Liebman, and Stephen E. Stein
AC - William E. Acree, Jr., James S. Chickos
Quantity | Value | Units | Method | Reference | Comment |
---|---|---|---|---|---|
ΔvapH° | 91. ± 3. | kJ/mol | V | Geiseler, Schaffernicht, et al., 1967 | ALS |
Quantity | Value | Units | Method | Reference | Comment |
ΔsubH° | 91.4 ± 2.5 | kJ/mol | N/A | Geiseler, Schaffernicht, et al., 1967 | See also Cox and Pilcher, 1970, 2.; AC |
Enthalpy of sublimation
ΔsubH (kJ/mol) | Temperature (K) | Reference | Comment |
---|---|---|---|
88.6 | 335. | Geiseler, Schaffernicht, et al., 1967 | Based on data from 321. to 348. K.; AC |

Gas phase ion energetics data

Data compiled as indicated in comments:
LLK - Sharon G. Lias, Rhoda D. Levin, and Sherif A. Kafafi
Ionization energy determinations
IE (eV) | Method | Reference | Comment |
---|---|---|---|
8.2 | PE | Guimon, Gonbeau, et al., 1974 | LLK |
8.40 | PE | Guimon, Gonbeau, et al., 1974 | Vertical value; LLK |

References

Geiseler, Schaffernicht, et al., 1967
Geiseler, V.G.; Schaffernicht, H.; Walther, H.J.,
Bildungsenthalpien und Mesomerieenergien von π-Bindungssystemen,
Ber. Bunsen-Ges. Phys. Chem., 1967, 71, 196-199. [all data]
Cox and Pilcher, 1970
Cox, J.D.; Pilcher, G.,
Thermochemistry of Organic and Organometallic Compounds, Academic Press, New York, 1970, 1-636. [all data]
Cox and Pilcher, 1970, 2
Cox, J.D.; Pilcher, G.,
Thermochemistry of Organic and Organometallic Compounds, Academic Press Inc., London, 1970, 643. [all data]
Guimon, Gonbeau, et al., 1974
Guimon, C.; Gonbeau, D.; Pfister-Guillouzo, G.; Asbrink, L.; Sandstrom, J.,
Electronic structure of sulphur compounds. VI. Photoelectron spectra of some simple thiocarbonyl compounds,
J. Electron Spectrosc. Relat. Phenom., 1974, 4, 49. [all data]