Tricyclo[4.1.0.01,3]heptane
- Formula: C7H10
- Molecular weight: 94.1543
- IUPAC Standard InChIKey: JEATYLXCUMDKCF-UHFFFAOYSA-N
- CAS Registry Number: 174-73-2
- Chemical structure:
View 3d structure (requires JavaScript / HTML 5) - Permanent link for this species. Use this link for bookmarking this species for future reference.

Gas phase ion energetics data

Data compiled by: Sharon G. Lias, John E. Bartmess, Joel F. Liebman, John L. Holmes, Rhoda D. Levin, and W. Gary Mallard
Ionization energy determinations
IE (eV) | Method | Reference | Comment |
---|---|---|---|
8.6 | PE | Gleiter, Krennrich, et al., 1986 | |
9.15 | PE | Gleiter, Krennrich, et al., 1986 | Vertical value |

References

Gleiter, Krennrich, et al., 1986
Gleiter, R.; Krennrich, G.; Brinker, U.H.,
Electronic structure of spiropentane and some derivatives,
J. Org. Chem., 1986, 51, 2899. [all data]