Silane, dichlorodiethenyl-
- Formula: C4H6Cl2Si
- Molecular weight: 153.082
- IUPAC Standard InChIKey: MAYIDWCWWMOISO-UHFFFAOYSA-N
- CAS Registry Number: 1745-72-8
- Chemical structure:
View 3d structure (requires JavaScript / HTML 5) - Other names: CH2=CHSiCl2CH=CH2; Divinyldichlorosilane; dichlorodivinylsilane

Gas phase ion energetics data

Data compiled as indicated in comments:
LLK - Sharon G. Lias, Rhoda D. Levin, and Sherif A. Kafafi
Ionization energy determinations
IE (eV) | Method | Reference | Comment |
---|---|---|---|
10.8 | PE | Khvostenko, Zykov, et al., 1981 | Vertical value; LLK |

References

Khvostenko, Zykov, et al., 1981
Khvostenko, V.I.; Zykov, B.G.; Yuriev, V.P.; Mironov, V.F.; Kovel'zon, G.I.; Panasenko, A.A.; Sheludyakov, V.D.; Gailyunas, I.A.,
Study of d(π)-p(π) interaction in vinyl- and alkylsilicon-containing compounds by photoelectron spectroscopy,
J. Organomet. Chem., 1981, 218, 155. [all data]